Reaction Details
TargetCarbonic anhydrase 12
LigandBDBM12917
Substrate/Competitorn/a
Meas. Tech.ChEMBL_441219 (CHEMBL891443)
Ki 8.3±n/a nM
Citation Wilkinson, BLBornaghi, LFHouston, TAInnocenti, AVullo, DSupuran, CTPoulsen, SA Inhibition of membrane-associated carbonic anhydrase isozymes IX, XII and XIV with a library of glycoconjugate benzenesulfonamides. Bioorg Med Chem Lett17:987-92 (2007) 
 
Carbonic anhydrase 12
Name:Carbonic anhydrase 12
Type:Enzyme
Mol. Mass.:39456.00
Organism:Homo sapiens (Human)
Description:Catalytic domain of human cloned isozyme was used in the assay
Residue:354
BDBM12917
NameBDBM12917
Synonyms:CHEMBL217569 Prop-2-ynyl 4-sulfamoylbenzoate | prop-2-yn-1-yl 4-sulfamoylbenzoate
TypeSmall organic molecule
Emp. Form.C10H9NO4S
Mol. Mass.239.248
SMILESNS(=O)(=O)c1ccc(cc1)C(=O)OCC#C