Reaction Details
TargetCarbonic anhydrase 12
LigandBDBM12944
Substrate/Competitorn/a
Meas. Tech.ChEMBL_441219 (CHEMBL891443)
Ki 8.1±n/a nM
Citation Wilkinson, BLBornaghi, LFHouston, TAInnocenti, AVullo, DSupuran, CTPoulsen, SA Inhibition of membrane-associated carbonic anhydrase isozymes IX, XII and XIV with a library of glycoconjugate benzenesulfonamides. Bioorg Med Chem Lett17:987-92 (2007) 
 
Carbonic anhydrase 12
Name:Carbonic anhydrase 12
Type:Enzyme
Mol. Mass.:39456.00
Organism:Homo sapiens (Human)
Description:Catalytic domain of human cloned isozyme was used in the assay
Residue:354
BDBM12944
NameBDBM12944
Synonyms:(1-{[(2R,3R,4S,5R,6S)-3,4,5-tris(acetyloxy)-6-methoxyoxan-2-yl]methyl}-1H-1,2,3-triazol-4-yl)methyl 4-sulfamoylbenzoate Glycoconjugate Benzene Sulfonamide 3g | Methyl 2,3,4-tri-O-acetyl-6-[4-({[4-(aminosulfonyl)benzoyl]-oxy}methyl)-1H-triazol-1-yl]-6-deoxy-alpha-D-glucopyranoside
TypeSmall organic molecule
Emp. Form.C23H28N4O12S
Mol. Mass.584.553
SMILESCO[C@H]1O[C@H](Cn2cc(COC(=O)c3ccc(cc3)S(N)(=O)=O)nn2)[C@@H](OC(C)=O)[C@H](OC(C)=O)[C@H]1OC(C)=O