Reaction Details
TargetCarbonic anhydrase 12
LigandBDBM10884
Substrate/Competitorn/a
Meas. Tech.ChEMBL_441219 (CHEMBL891443)
Ki 3.5±n/a nM
Citation Wilkinson, BLBornaghi, LFHouston, TAInnocenti, AVullo, DSupuran, CTPoulsen, SA Inhibition of membrane-associated carbonic anhydrase isozymes IX, XII and XIV with a library of glycoconjugate benzenesulfonamides. Bioorg Med Chem Lett17:987-92 (2007) 
 
Carbonic anhydrase 12
Name:Carbonic anhydrase 12
Type:Enzyme
Mol. Mass.:39456.00
Organism:Homo sapiens (Human)
Description:Catalytic domain of human cloned isozyme was used in the assay
Residue:354
BDBM10884
NameBDBM10884
Synonyms:(2S,4S)-4-(ethylamino)-2-methyl-1,1-dioxo-2H,3H,4H-1,7-thieno[2,3-b]thiopyran-6-sulfonamide Dorzolamide (DZA)
TypeSmall organic molecule
Emp. Form.C10H16N2O4S3
Mol. Mass.324.44
SMILESCCN[C@H]1C[C@H](C)S(=O)(=O)c2sc(cc12)S(N)(=O)=O