Reaction Details
TargetCarbonic anhydrase 14
LigandBDBM12923
Substrate/Competitorn/a
Meas. Tech.ChEMBL_441220 (CHEMBL891444)
Ki 55±n/a nM
Citation Wilkinson, BLBornaghi, LFHouston, TAInnocenti, AVullo, DSupuran, CTPoulsen, SA Inhibition of membrane-associated carbonic anhydrase isozymes IX, XII and XIV with a library of glycoconjugate benzenesulfonamides. Bioorg Med Chem Lett17:987-92 (2007) 
 
Carbonic anhydrase 14
Name:Carbonic anhydrase 14
Type:Enzyme
Mol. Mass.:37665.67
Organism:Homo sapiens (Human)
Description:Human (cloned) isozyme.
Residue:337
BDBM12923
NameBDBM12923
Synonyms:4-(4-Sulfamoylbenzamido)methyl-1-(beta-D-galactopyranosyl)-1H-1,2,3-triazole CHEMBL386416 | Glycoconjugate Benzene Sulfonamide 2bb
TypeSmall organic molecule
Emp. Form.C16H21N5O8S
Mol. Mass.443.432
SMILESNS(=O)(=O)c1ccc(cc1)C(=O)NCc1cn(nn1)[C@@H]1O[C@H](CO)[C@H](O)[C@H](O)[C@H]1O