Reaction Details
TargetCoagulation factor X
LigandBDBM50216594
Substrate/Competitorn/a
Meas. Tech.ChEMBL_447824 (CHEMBL898074)
Ki 1.7±n/a nM
Citation Qiao, JXChang, CHCheney, DLMorin, PEWang, GZKing, SRWang, TCRendina, ARLuettgen, JMKnabb, RMWexler, RRLam, PY SAR and X-ray structures of enantiopure 1,2-cis-(1R,2S)-cyclopentyldiamine and cyclohexyldiamine derivatives as inhibitors of coagulation Factor Xa. Bioorg Med Chem Lett17:4419-27 (2007) 
 
Coagulation factor X
Name:Coagulation factor X
Type:Enzyme
Mol. Mass.:54726.60
Organism:Homo sapiens (Human)
Description:n/a
Residue:488
BDBM50216594
NameBDBM50216594
Synonyms:5-chloro-N-(1-(4-(2-oxopyridin-1(2H)-yl)benzamido)propan-2-yl)thiophene-2-carboxamide | CHEMBL393421
TypeSmall organic molecule
Emp. Form.C20H18ClN3O3S
Mol. Mass.415.893
SMILESCC(CNC(=O)c1ccc(cc1)-n1ccccc1=O)NC(=O)c1ccc(Cl)s1