Reaction Details
TargetTissue-type plasminogen activator
LigandBDBM50216557
Substrate/Competitorn/a
Meas. Tech.ChEMBL_447832 (CHEMBL898082)
Ki>20000±n/a nM
Citation Qiao, JXChang, CHCheney, DLMorin, PEWang, GZKing, SRWang, TCRendina, ARLuettgen, JMKnabb, RMWexler, RRLam, PY SAR and X-ray structures of enantiopure 1,2-cis-(1R,2S)-cyclopentyldiamine and cyclohexyldiamine derivatives as inhibitors of coagulation Factor Xa. Bioorg Med Chem Lett17:4419-27 (2007) 
 
Tissue-type plasminogen activator
Name:Tissue-type plasminogen activator
Type:Enzyme
Mol. Mass.:62931.08
Organism:Homo sapiens (Human)
Description:n/a
Residue:562
BDBM50216557
NameBDBM50216557
Synonyms:5-chloro-N-((1R,2S)-2-(4-(2-oxopiperidin-1-yl)benzamido)cyclopentyl)thiophene-2-carboxamide | CHEMBL399593
TypeSmall organic molecule
Emp. Form.C22H24ClN3O3S
Mol. Mass.445.962
SMILESClc1ccc(s1)C(=O)N[C@@H]1CCC[C@@H]1NC(=O)c1ccc(cc1)N1CCCCC1=O