Reaction Details
TargetDipeptidyl peptidase 4
LigandBDBM50221085
Substrate/Competitorn/a
Meas. Tech.ChEMBL_449465 (CHEMBL899730)
IC50 51±n/a nM
Citation Wright, SWAmmirati, MJAndrews, KMBrodeur, AMDanley, DEDoran, SDLillquist, JSLiu, SMcClure, LDMcPherson, RKOlson, TVOrena, SJParker, JCRocke, BNSoeller, WCSoglia, CBTreadway, JLVanvolkenburg, MAZhao, ZCox, ED (3R,4S)-4-(2,4,5-Trifluorophenyl)-pyrrolidin-3-ylamine inhibitors of dipeptidyl peptidase IV: synthesis, in vitro, in vivo, and X-ray crystallographic characterization. Bioorg Med Chem Lett17:5638-42 (2007) 
 
Dipeptidyl peptidase 4
Name:Dipeptidyl peptidase 4
Type:Enzyme
Mol. Mass.:88271.01
Organism:Homo sapiens (Human)
Description:P27487
Residue:766
BDBM50221085
NameBDBM50221085
Synonyms:(3R,4S)-1-(6-(3-fluorophenyl)pyrimidin-4-yl)-4-(2,4,5-trifluorophenyl)pyrrolidin-3-amine | CHEMBL237343
TypeSmall organic molecule
Emp. Form.C20H16F4N4
Mol. Mass.388.3615
SMILESN[C@H]1CN(C[C@@H]1c1cc(F)c(F)cc1F)c1cc(ncn1)-c1cccc(F)c1