Reaction Details
TargetDipeptidyl peptidase 4
LigandBDBM50221102
Substrate/Competitorn/a
Meas. Tech.ChEMBL_449465 (CHEMBL899730)
IC50 14±n/a nM
Citation Wright, SWAmmirati, MJAndrews, KMBrodeur, AMDanley, DEDoran, SDLillquist, JSLiu, SMcClure, LDMcPherson, RKOlson, TVOrena, SJParker, JCRocke, BNSoeller, WCSoglia, CBTreadway, JLVanvolkenburg, MAZhao, ZCox, ED (3R,4S)-4-(2,4,5-Trifluorophenyl)-pyrrolidin-3-ylamine inhibitors of dipeptidyl peptidase IV: synthesis, in vitro, in vivo, and X-ray crystallographic characterization. Bioorg Med Chem Lett17:5638-42 (2007) 
 
Dipeptidyl peptidase 4
Name:Dipeptidyl peptidase 4
Type:Enzyme
Mol. Mass.:88271.01
Organism:Homo sapiens (Human)
Description:P27487
Residue:766
BDBM50221102
NameBDBM50221102
Synonyms:CHEMBL236719 | N-(3-(6-((3R,4S)-3-amino-4-(2,4,5-trifluorophenyl)pyrrolidin-1-yl)pyrimidin-4-yl)phenyl)acetamide
TypeSmall organic molecule
Emp. Form.C22H20F3N5O
Mol. Mass.427.4223
SMILESCC(=O)Nc1cccc(c1)-c1cc(ncn1)N1C[C@H](N)[C@H](C1)c1cc(F)c(F)cc1F