Reaction Details
TargetEnoyl-[acyl-carrier-protein] reductase [NADH] FabI
LigandBDBM50223363
Substrate/Competitorn/a
Meas. Tech.ChEMBL_450121 (CHEMBL900393)
IC50>32000±n/a nM
Citation Ozawa, TKitagawa, HYamamoto, YTakahata, SIida, MOsaki, YYamada, K Phenylimidazole derivatives as specific inhibitors of bacterial enoyl-acyl carrier protein reductase FabK. Bioorg Med Chem15:7325-36 (2007) 
 
Enoyl-[acyl-carrier-protein] reductase [NADH] FabI
Name:Enoyl-[acyl-carrier-protein] reductase [NADH] FabI
Type:Enzyme
Mol. Mass.:27861.12
Organism:Escherichia coli
Description:n/a
Residue:262
BDBM50223363
NameBDBM50223363
Synonyms:4-(2-(3-((4-phenyl-1H-imidazol-2-yl)methyl)ureido)thiazol-5-ylthio)benzoic acid | CHEMBL235273
TypeSmall organic molecule
Emp. Form.C21H17N5O3S2
Mol. Mass.451.521
SMILESOC(=O)c1ccc(Sc2cnc(NC(=O)NCc3nc(c[nH]3)-c3ccccc3)s2)cc1