Reaction Details
TargetEnoyl-[acyl-carrier-protein] reductase [NADH] FabI
LigandBDBM50219763
Substrate/Competitorn/a
Meas. Tech.ChEMBL_450121 (CHEMBL900393)
IC50>32000±n/a nM
Citation Ozawa, TKitagawa, HYamamoto, YTakahata, SIida, MOsaki, YYamada, K Phenylimidazole derivatives as specific inhibitors of bacterial enoyl-acyl carrier protein reductase FabK. Bioorg Med Chem15:7325-36 (2007) 
 
Enoyl-[acyl-carrier-protein] reductase [NADH] FabI
Name:Enoyl-[acyl-carrier-protein] reductase [NADH] FabI
Type:Enzyme
Mol. Mass.:27861.12
Organism:Escherichia coli
Description:n/a
Residue:262
BDBM50219763
NameBDBM50219763
Synonyms:1-((4-(4-bromophenyl)-1H-imidazol-2-yl)methyl)-3-(5-(pyridin-2-ylthio)thiazol-2-yl)urea CHEMBL244805
TypeSmall organic molecule
Emp. Form.C19H15BrN6OS2
Mol. Mass.487.396
SMILESBrc1ccc(cc1)-c1c[nH]c(CNC(=O)Nc2ncc(Sc3ccccn3)s2)n1