Reaction Details
TargetEnoyl-[acyl-carrier-protein] reductase [NADH] FabI
LigandBDBM50223366
Substrate/Competitorn/a
Meas. Tech.ChEMBL_450121 (CHEMBL900393)
IC50>32000±n/a nM
Citation Ozawa, TKitagawa, HYamamoto, YTakahata, SIida, MOsaki, YYamada, K Phenylimidazole derivatives as specific inhibitors of bacterial enoyl-acyl carrier protein reductase FabK. Bioorg Med Chem15:7325-36 (2007) 
 
Enoyl-[acyl-carrier-protein] reductase [NADH] FabI
Name:Enoyl-[acyl-carrier-protein] reductase [NADH] FabI
Type:Enzyme
Mol. Mass.:27861.12
Organism:Escherichia coli
Description:n/a
Residue:262
BDBM50223366
NameBDBM50223366
Synonyms:1-((4-phenyl-1H-imidazol-2-yl)methyl)-3-(4-phenylthiazol-2-yl)urea | CHEMBL393210
TypeSmall organic molecule
Emp. Form.C20H17N5OS
Mol. Mass.375.447
SMILESO=C(NCc1nc(c[nH]1)-c1ccccc1)Nc1nc(cs1)-c1ccccc1