Reaction Details
TargetBeta-2 adrenergic receptor
LigandBDBM50223429
Substrate/Competitorn/a
Meas. Tech.ChEMBL_450127 (CHEMBL900403)
EC50 0.051000±n/a nM
Citation Brown, ADBunnage, MEGlossop, PAHolbrook, MJones, RDLane, CALewthwaite, RAMantell, SPerros-Huguet, CPrice, DAWebster, R The discovery of indole-derived long acting beta2-adrenoceptor agonists for the treatment of asthma and COPD. Bioorg Med Chem Lett17:6188-91 (2007) 
 
Beta-2 adrenergic receptor
Name:Beta-2 adrenergic receptor
Type:n/a
Mol. Mass.:46461.69
Organism:Homo sapiens (Human)
Description:P07550
Residue:413
BDBM50223429
NameBDBM50223429
Synonyms:CHEMBL236251 | N-(cyclobutylmethyl)-5-((R)-2-((R)-2-hydroxy-2-(4-hydroxy-3-(hydroxymethyl)phenyl)ethylamino)propyl)-1H-indole-2-carboxamide
TypeSmall organic molecule
Emp. Form.C26H33N3O4
Mol. Mass.451.5579
SMILESC[C@H](Cc1ccc2[nH]c(cc2c1)C(=O)NCC1CCC1)NC[C@H](O)c1ccc(O)c(CO)c1