Reaction Details
TargetBeta-2 adrenergic receptor
LigandBDBM50223440
Substrate/Competitorn/a
Meas. Tech.ChEMBL_450127 (CHEMBL900403)
EC50 0.038000±n/a nM
Citation Brown, ADBunnage, MEGlossop, PAHolbrook, MJones, RDLane, CALewthwaite, RAMantell, SPerros-Huguet, CPrice, DAWebster, R The discovery of indole-derived long acting beta2-adrenoceptor agonists for the treatment of asthma and COPD. Bioorg Med Chem Lett17:6188-91 (2007) 
 
Beta-2 adrenergic receptor
Name:Beta-2 adrenergic receptor
Type:n/a
Mol. Mass.:46461.69
Organism:Homo sapiens (Human)
Description:P07550
Residue:413
BDBM50223440
NameBDBM50223440
Synonyms:CHEMBL236040 | N-(2-(methylthio)benzyl)-5-((R)-2-((R)-2-hydroxy-2-(4-hydroxy-3-(hydroxymethyl)phenyl)ethylamino)propyl)-1H-indole-2-carboxamide
TypeSmall organic molecule
Emp. Form.C29H33N3O4S
Mol. Mass.519.655
SMILESCSc1ccccc1CNC(=O)c1cc2cc(C[C@@H](C)NC[C@H](O)c3ccc(O)c(CO)c3)ccc2[nH]1