Reaction Details
TargetBeta-2 adrenergic receptor
LigandBDBM50223437
Substrate/Competitorn/a
Meas. Tech.ChEMBL_450127 (CHEMBL900403)
EC50 0.164000±n/a nM
Citation Brown, ADBunnage, MEGlossop, PAHolbrook, MJones, RDLane, CALewthwaite, RAMantell, SPerros-Huguet, CPrice, DAWebster, R The discovery of indole-derived long acting beta2-adrenoceptor agonists for the treatment of asthma and COPD. Bioorg Med Chem Lett17:6188-91 (2007) 
 
Beta-2 adrenergic receptor
Name:Beta-2 adrenergic receptor
Type:n/a
Mol. Mass.:46461.69
Organism:Homo sapiens (Human)
Description:P07550
Residue:413
BDBM50223437
NameBDBM50223437
Synonyms:CHEMBL394339 | N-(4-hydroxybenzyl)-5-((R)-2-((R)-2-hydroxy-2-(4-hydroxy-3-(hydroxymethyl)phenyl)ethylamino)propyl)-1H-indole-2-carboxamide
TypeSmall organic molecule
Emp. Form.C28H31N3O5
Mol. Mass.489.5628
SMILESC[C@H](Cc1ccc2[nH]c(cc2c1)C(=O)NCc1ccc(O)cc1)NC[C@H](O)c1ccc(O)c(CO)c1