Reaction Details
TargetAdenosine receptor A3
LigandBDBM50165335
Substrate/Competitorn/a
Meas. Tech.ChEMBL_450740 (CHEMBL901023)
IC50 12±n/a nM
Citation Da Settimo, FPrimofiore, GTaliani, SMarini, AMLa Motta, CSimorini, FSalerno, SSergianni, VTuccinardi, TMartinelli, ACosimelli, BGreco, GNovellino, ECiampi, OTrincavelli, MLMartini, C 5-amino-2-phenyl[1,2,3]triazolo[1,2-a][1,2,4]benzotriazin-1-one: a versatile scaffold to obtain potent and selective A3 adenosine receptor antagonists. J Med Chem50:5676-84 (2007) 
 
Adenosine receptor A3
Name:Adenosine receptor A3
Type:G Protein-Coupled Receptor (GPCR)
Mol. Mass.:36197.32
Organism:Homo sapiens (Human)
Description:P0DMS8
Residue:318
BDBM50165335
NameBDBM50165335
Synonyms:2-(4-Chloro-phenyl)-5H-3,3a,5,9b-tetraaza-cyclopenta[a]naphthalene-1,4-dione | CHEMBL193141
TypeSmall organic molecule
Emp. Form.C15H9ClN4O2
Mol. Mass.312.711
SMILESClc1ccc(cc1)-c1nn2n(c3ccccc3[nH]c2=O)c1=O