Reaction Details
TargetAdenosine receptor A1
LigandBDBM50224348
Substrate/Competitorn/a
Meas. Tech.ChEMBL_450735 (CHEMBL901018)
Ki>10000±n/a nM
Citation Da Settimo, FPrimofiore, GTaliani, SMarini, AMLa Motta, CSimorini, FSalerno, SSergianni, VTuccinardi, TMartinelli, ACosimelli, BGreco, GNovellino, ECiampi, OTrincavelli, MLMartini, C 5-amino-2-phenyl[1,2,3]triazolo[1,2-a][1,2,4]benzotriazin-1-one: a versatile scaffold to obtain potent and selective A3 adenosine receptor antagonists. J Med Chem50:5676-84 (2007) 
 
Adenosine receptor A1
Name:Adenosine receptor A1
Type:G Protein-Coupled Receptor (GPCR)
Mol. Mass.:36520.92
Organism:Homo sapiens (Human)
Description:P30542
Residue:326
BDBM50224348
NameBDBM50224348
Synonyms:CHEMBL235296 | N-[2-(4-chloro-phenyl)-1-oxo-1H-3,3,5,9b-tetraaza-cyclopenta[a]naphthalen-4-yl]-4-methoxy-benzamide
TypeSmall organic molecule
Emp. Form.C23H16ClN5O3
Mol. Mass.445.858
SMILESCOc1ccc(cc1)C(=O)Nc1nc2ccccc2n2n1nc(-c1ccc(Cl)cc1)c2=O