Reaction Details
TargetAdenosine receptor A1
LigandBDBM50224344
Substrate/Competitorn/a
Meas. Tech.ChEMBL_450735 (CHEMBL901018)
Ki 256±n/a nM
Citation Da Settimo, FPrimofiore, GTaliani, SMarini, AMLa Motta, CSimorini, FSalerno, SSergianni, VTuccinardi, TMartinelli, ACosimelli, BGreco, GNovellino, ECiampi, OTrincavelli, MLMartini, C 5-amino-2-phenyl[1,2,3]triazolo[1,2-a][1,2,4]benzotriazin-1-one: a versatile scaffold to obtain potent and selective A3 adenosine receptor antagonists. J Med Chem50:5676-84 (2007) 
 
Adenosine receptor A1
Name:Adenosine receptor A1
Type:G Protein-Coupled Receptor (GPCR)
Mol. Mass.:36520.92
Organism:Homo sapiens (Human)
Description:P30542
Residue:326
BDBM50224344
NameBDBM50224344
Synonyms:3-chloro-N-(1-oxo-2-p-tolyl-1H-3,3a,5,9b-tetraaza-cyclopenta[a]naphthalen-4-yl)-benzamide | CHEMBL235512
TypeSmall organic molecule
Emp. Form.C23H16ClN5O2
Mol. Mass.429.858
SMILESCc1ccc(cc1)-c1nn2c(NC(=O)c3cccc(Cl)c3)nc3ccccc3n2c1=O