Reaction Details
TargetAdenosine receptor A1
LigandBDBM50165325
Substrate/Competitorn/a
Meas. Tech.ChEMBL_450735 (CHEMBL901018)
Ki 1070.5±n/a nM
Citation Da Settimo, FPrimofiore, GTaliani, SMarini, AMLa Motta, CSimorini, FSalerno, SSergianni, VTuccinardi, TMartinelli, ACosimelli, BGreco, GNovellino, ECiampi, OTrincavelli, MLMartini, C 5-amino-2-phenyl[1,2,3]triazolo[1,2-a][1,2,4]benzotriazin-1-one: a versatile scaffold to obtain potent and selective A3 adenosine receptor antagonists. J Med Chem50:5676-84 (2007) 
 
Adenosine receptor A1
Name:Adenosine receptor A1
Type:G Protein-Coupled Receptor (GPCR)
Mol. Mass.:36520.92
Organism:Homo sapiens (Human)
Description:P30542
Residue:326
BDBM50165325
NameBDBM50165325
Synonyms:2-(4-Methoxy-phenyl)-5H-3,3a,5,9b-tetraaza-cyclopenta[a]naphthalene-1,4-dione | CHEMBL192554
TypeSmall organic molecule
Emp. Form.C16H12N4O3
Mol. Mass.308.2915
SMILESCOc1ccc(cc1)-c1nn2n(c3ccccc3[nH]c2=O)c1=O