Reaction Details
TargetAdenosine receptor A3
LigandBDBM50224361
Substrate/Competitorn/a
Meas. Tech.ChEMBL_450737 (CHEMBL901020)
Ki 557.3±n/a nM
Citation Da Settimo, FPrimofiore, GTaliani, SMarini, AMLa Motta, CSimorini, FSalerno, SSergianni, VTuccinardi, TMartinelli, ACosimelli, BGreco, GNovellino, ECiampi, OTrincavelli, MLMartini, C 5-amino-2-phenyl[1,2,3]triazolo[1,2-a][1,2,4]benzotriazin-1-one: a versatile scaffold to obtain potent and selective A3 adenosine receptor antagonists. J Med Chem50:5676-84 (2007) 
 
Adenosine receptor A3
Name:Adenosine receptor A3
Type:G Protein-Coupled Receptor (GPCR)
Mol. Mass.:36197.32
Organism:Homo sapiens (Human)
Description:P0DMS8
Residue:318
BDBM50224361
NameBDBM50224361
Synonyms:4-amino-8-chloro-2-(4-chloro-phenyl)-3,3a,5,9b-tetraaza-cyclopenta[a]naphthalen-1-one | CHEMBL235076
TypeSmall organic molecule
Emp. Form.C15H9Cl2N5O
Mol. Mass.346.171
SMILESNc1nc2ccc(Cl)cc2n2n1nc(-c1ccc(Cl)cc1)c2=O