Reaction Details
TargetAdenosine receptor A2b
LigandBDBM50224355
Substrate/Competitorn/a
Meas. Tech.ChEMBL_450738 (CHEMBL901021)
IC50>1000±n/a nM
Citation Da Settimo, FPrimofiore, GTaliani, SMarini, AMLa Motta, CSimorini, FSalerno, SSergianni, VTuccinardi, TMartinelli, ACosimelli, BGreco, GNovellino, ECiampi, OTrincavelli, MLMartini, C 5-amino-2-phenyl[1,2,3]triazolo[1,2-a][1,2,4]benzotriazin-1-one: a versatile scaffold to obtain potent and selective A3 adenosine receptor antagonists. J Med Chem50:5676-84 (2007) 
 
Adenosine receptor A2b
Name:Adenosine receptor A2b
Type:G Protein-Coupled Receptor (GPCR)
Mol. Mass.:36341.22
Organism:Homo sapiens (Human)
Description:n/a
Residue:332
BDBM50224355
NameBDBM50224355
Synonyms:CHEMBL235513 | N-(8-chloro-1-oxo-2-phenyl-1H-3,3a,5,9b-tetraaza-cyclopenta[a]naphthalen-4-yl)-4-methoxy-benzamide
TypeSmall organic molecule
Emp. Form.C23H16ClN5O3
Mol. Mass.445.858
SMILESCOc1ccc(cc1)C(=O)Nc1nc2ccc(Cl)cc2n2n1nc(-c1ccccc1)c2=O