Reaction Details
TargetAdenosine receptor A1
LigandBDBM50165328
Substrate/Competitorn/a
Meas. Tech.ChEMBL_450735 (CHEMBL901018)
Ki 339.5±n/a nM
Citation Da Settimo, FPrimofiore, GTaliani, SMarini, AMLa Motta, CSimorini, FSalerno, SSergianni, VTuccinardi, TMartinelli, ACosimelli, BGreco, GNovellino, ECiampi, OTrincavelli, MLMartini, C 5-amino-2-phenyl[1,2,3]triazolo[1,2-a][1,2,4]benzotriazin-1-one: a versatile scaffold to obtain potent and selective A3 adenosine receptor antagonists. J Med Chem50:5676-84 (2007) 
 
Adenosine receptor A1
Name:Adenosine receptor A1
Type:G Protein-Coupled Receptor (GPCR)
Mol. Mass.:36520.92
Organism:Homo sapiens (Human)
Description:P30542
Residue:326
BDBM50165328
NameBDBM50165328
Synonyms:2-Phenyl-5H-3,3a,5,9b-tetraaza-cyclopenta[a]naphthalene-1,4-dione | CHEMBL192555
TypeSmall organic molecule
Emp. Form.C15H10N4O2
Mol. Mass.278.2655
SMILESO=c1c(nn2n1c1ccccc1[nH]c2=O)-c1ccccc1