Reaction Details
TargetAdenosine receptor A2a
LigandBDBM50224359
Substrate/Competitorn/a
Meas. Tech.ChEMBL_450736 (CHEMBL901019)
Ki 262.1±n/a nM
Citation Da Settimo, FPrimofiore, GTaliani, SMarini, AMLa Motta, CSimorini, FSalerno, SSergianni, VTuccinardi, TMartinelli, ACosimelli, BGreco, GNovellino, ECiampi, OTrincavelli, MLMartini, C 5-amino-2-phenyl[1,2,3]triazolo[1,2-a][1,2,4]benzotriazin-1-one: a versatile scaffold to obtain potent and selective A3 adenosine receptor antagonists. J Med Chem50:5676-84 (2007) 
 
Adenosine receptor A2a
Name:Adenosine receptor A2a
Type:G Protein-Coupled Receptor (GPCR)
Mol. Mass.:44716.46
Organism:Homo sapiens (Human)
Description:P29274
Residue:412
BDBM50224359
NameBDBM50224359
Synonyms:1-(4-methoxy-phenyl)-3-(1-oxo-2-phenyl-1H-3,3a,5,9b-tetraaza-cyclopenta[a]naphthalen-4-yl)-urea | CHEMBL235719
TypeSmall organic molecule
Emp. Form.C23H18N6O3
Mol. Mass.426.4274
SMILESCOc1ccc(NC(=O)Nc2nc3ccccc3n3n2nc(-c2ccccc2)c3=O)cc1