Reaction Details
TargetDelta-type opioid receptor
LigandBDBM50226257
Substrate/Competitorn/a
Meas. Tech.ChEMBL_451933 (CHEMBL901091)
Ki 2576±n/a nM
Citation Takeuchi, KHolloway, WGMitch, CHQuimby, SJMcKinzie, JHSuter, TMStatnick, MASurface, PLEmmerson, PJThomas, EMSiegel, MG Structure activity relationship studies of carboxamido-biaryl ethers as opioid receptor antagonists (OpRAs). Part 2. Bioorg Med Chem Lett17:6841-6 (2007) 
 
Delta-type opioid receptor
Name:Delta-type opioid receptor
Type:G Protein-Coupled Receptor (GPCR)
Mol. Mass.:40382.98
Organism:Homo sapiens (Human)
Description:Competition binding assays were carried out using membrane preparations from transfected HN9.10 cells that constitutively expressed the delta opioid receptor.
Residue:372
BDBM50226257
NameBDBM50226257
Synonyms:6-(2-(3-morpholinopropyl)-2,3,4,5-tetrahydro-1H-benzo[c]azepin-7-yloxy)nicotinamide | CHEMBL238364
TypeSmall organic molecule
Emp. Form.C23H30N4O3
Mol. Mass.410.5093
SMILESNC(=O)c1ccc(Oc2ccc3CN(CCCN4CCOCC4)CCCc3c2)nc1