Reaction Details
TargetDelta-type opioid receptor
LigandBDBM50226258
Substrate/Competitorn/a
Meas. Tech.ChEMBL_451933 (CHEMBL901091)
Ki 2274±n/a nM
Citation Takeuchi, KHolloway, WGMitch, CHQuimby, SJMcKinzie, JHSuter, TMStatnick, MASurface, PLEmmerson, PJThomas, EMSiegel, MG Structure activity relationship studies of carboxamido-biaryl ethers as opioid receptor antagonists (OpRAs). Part 2. Bioorg Med Chem Lett17:6841-6 (2007) 
 
Delta-type opioid receptor
Name:Delta-type opioid receptor
Type:G Protein-Coupled Receptor (GPCR)
Mol. Mass.:40382.98
Organism:Homo sapiens (Human)
Description:Competition binding assays were carried out using membrane preparations from transfected HN9.10 cells that constitutively expressed the delta opioid receptor.
Residue:372
BDBM50226258
NameBDBM50226258
Synonyms:6-(2-phenethylisoindolin-5-yloxy)nicotinamide | CHEMBL235154
TypeSmall organic molecule
Emp. Form.C22H21N3O2
Mol. Mass.359.421
SMILESNC(=O)c1ccc(Oc2ccc3CN(CCc4ccccc4)Cc3c2)nc1