Reaction Details
TargetMu-type opioid receptor
LigandBDBM50045775
Substrate/Competitorn/a
Meas. Tech.ChEMBL_451931 (CHEMBL901089)
Ki 0.150000±n/a nM
Citation Takeuchi, KHolloway, WGMitch, CHQuimby, SJMcKinzie, JHSuter, TMStatnick, MASurface, PLEmmerson, PJThomas, EMSiegel, MG Structure activity relationship studies of carboxamido-biaryl ethers as opioid receptor antagonists (OpRAs). Part 2. Bioorg Med Chem Lett17:6841-6 (2007) 
 
Mu-type opioid receptor
Name:Mu-type opioid receptor
Type:G Protein-Coupled Receptor (GPCR)
Mol. Mass.:44789.51
Organism:Homo sapiens (Human)
Description:P35372
Residue:400
BDBM50045775
NameBDBM50045775
Synonyms:(3R,4R)3-[1-(3-Cyclohexyl-3-hydroxy-propyl)-3,4-dimethyl-piperidin-4-yl]-phenol 3-[(3R,4R)-1-((S)-3-Cyclohexyl-3-hydroxy-propyl)-3,4-dimethyl-piperidin-4-yl]-phenol CHEMBL300662 | LY-255582
TypeSmall organic molecule
Emp. Form.C22H35NO2
Mol. Mass.345.5188
SMILESC[C@H]1CN(CC[C@H](O)C2CCCCC2)CC[C@@]1(C)c1cccc(O)c1