Reaction Details
TargetKappa-type opioid receptor
LigandBDBM50226255
Substrate/Competitorn/a
Meas. Tech.ChEMBL_451932 (CHEMBL901090)
Ki 704±n/a nM
Citation Takeuchi, KHolloway, WGMitch, CHQuimby, SJMcKinzie, JHSuter, TMStatnick, MASurface, PLEmmerson, PJThomas, EMSiegel, MG Structure activity relationship studies of carboxamido-biaryl ethers as opioid receptor antagonists (OpRAs). Part 2. Bioorg Med Chem Lett17:6841-6 (2007) 
 
Kappa-type opioid receptor
Name:Kappa-type opioid receptor
Type:G Protein-Coupled Receptor (GPCR)
Mol. Mass.:42648.76
Organism:Homo sapiens (Human)
Description:P41145
Residue:380
BDBM50226255
NameBDBM50226255
Synonyms:6-(2-(3-cyclohexylpropyl)-2,3,4,5-tetrahydro-1H-benzo[c]azepin-7-yloxy)nicotinamide | CHEMBL238157
TypeSmall organic molecule
Emp. Form.C25H33N3O2
Mol. Mass.407.5484
SMILESNC(=O)c1ccc(Oc2ccc3CN(CCCC4CCCCC4)CCCc3c2)nc1