Reaction Details
TargetKappa-type opioid receptor
LigandBDBM50226258
Substrate/Competitorn/a
Meas. Tech.ChEMBL_451932 (CHEMBL901090)
Ki>5000±n/a nM
Citation Takeuchi, KHolloway, WGMitch, CHQuimby, SJMcKinzie, JHSuter, TMStatnick, MASurface, PLEmmerson, PJThomas, EMSiegel, MG Structure activity relationship studies of carboxamido-biaryl ethers as opioid receptor antagonists (OpRAs). Part 2. Bioorg Med Chem Lett17:6841-6 (2007) 
 
Kappa-type opioid receptor
Name:Kappa-type opioid receptor
Type:G Protein-Coupled Receptor (GPCR)
Mol. Mass.:42648.76
Organism:Homo sapiens (Human)
Description:P41145
Residue:380
BDBM50226258
NameBDBM50226258
Synonyms:6-(2-phenethylisoindolin-5-yloxy)nicotinamide | CHEMBL235154
TypeSmall organic molecule
Emp. Form.C22H21N3O2
Mol. Mass.359.421
SMILESNC(=O)c1ccc(Oc2ccc3CN(CCc4ccccc4)Cc3c2)nc1