Reaction Details
TargetMu-type opioid receptor
LigandBDBM50226266
Substrate/Competitorn/a
Meas. Tech.ChEMBL_451931 (CHEMBL901089)
Ki 24±n/a nM
Citation Takeuchi, KHolloway, WGMitch, CHQuimby, SJMcKinzie, JHSuter, TMStatnick, MASurface, PLEmmerson, PJThomas, EMSiegel, MG Structure activity relationship studies of carboxamido-biaryl ethers as opioid receptor antagonists (OpRAs). Part 2. Bioorg Med Chem Lett17:6841-6 (2007) 
 
Mu-type opioid receptor
Name:Mu-type opioid receptor
Type:G Protein-Coupled Receptor (GPCR)
Mol. Mass.:44789.51
Organism:Homo sapiens (Human)
Description:P35372
Residue:400
BDBM50226266
NameBDBM50226266
Synonyms:6-(2-(4,4,4-trifluorobutyl)-2,3,4,5-tetrahydro-1H-benzo[c]azepin-7-yloxy)nicotinamide | CHEMBL439038
TypeSmall organic molecule
Emp. Form.C20H22F3N3O2
Mol. Mass.393.4028
SMILESNC(=O)c1ccc(Oc2ccc3CN(CCCC(F)(F)F)CCCc3c2)nc1