Reaction Details
TargetProstaglandin G/H synthase 1
LigandBDBM11639
Substrate/Competitorn/a
Meas. Tech.ChEMBL_452249 (CHEMBL901401)
IC50 14000±n/a nM
Citation Wey, SJAugustyniak, MECochran, EDEllis, JLFang, XGarvey, DSJanero, DRLetts, LGMartino, AMMelim, TLMurty, MGRichardson, SKSchroeder, JDSelig, WMTrocha, AMWexler, RSYoung, DVZemtseva, ISZifcak, BM Structure-based design, synthesis, and biological evaluation of indomethacin derivatives as cyclooxygenase-2 inhibiting nitric oxide donors. J Med Chem50:6367-82 (2007) 
 
Prostaglandin G/H synthase 1
Name:Prostaglandin G/H synthase 1
Type:Enzyme
Mol. Mass.:68692.62
Organism:Homo sapiens (Human)
Description:P23219
Residue:599
BDBM11639
NameBDBM11639
Synonyms:4-[5-(4-methylphenyl)-3-(trifluoromethyl)-1H-pyrazol-1-yl]benzene-1-sulfonamide CLX Celecoxib US11478464, Compound Celecoxib US8741944, Comparative Compound cid_2662
TypeSmall organic molecule
Emp. Form.C17H14F3N3O2S
Mol. Mass.381.372
SMILESCc1ccc(cc1)-c1cc(nn1-c1ccc(cc1)S(N)(=O)=O)C(F)(F)F