Reaction Details
TargetProtein kinase C beta type
LigandBDBM50371215
Substrate/Competitorn/a
Meas. Tech.ChEMBL_454903 (CHEMBL886932)
IC50 1400±n/a nM
Citation Zhang, HCBoñaga, LVYe, HDerian, CKDamiano, BPMaryanoff, BE Novel bis(indolyl)maleimide pyridinophanes that are potent, selective inhibitors of glycogen synthase kinase-3. Bioorg Med Chem Lett17:2863-8 (2007) 
 
Protein kinase C beta type
Name:Protein kinase C beta type
Type:Enzyme
Mol. Mass.:76873.67
Organism:Homo sapiens (Human)
Description:The recombinant human PKC enzymes were produced using a baculovirus expression system in SF9 cells
Residue:671
BDBM50371215
NameBDBM50371215
Synonyms:CHEMBL1162963
TypeSmall organic molecule
Emp. Form.C32H29N5O2
Mol. Mass.515.605
SMILESCN(C)c1nc2CCn3cc(C4=C(C(=O)NC4=O)c4cn(CCCc1cc2)c1ccccc41)c1ccccc31