Reaction Details
TargetBDNF/NT-3 growth factors receptor
LigandBDBM50371215
Substrate/Competitorn/a
Meas. Tech.ChEMBL_455010 (CHEMBL887039)
IC50>3000±n/a nM
Citation Zhang, HCBoñaga, LVYe, HDerian, CKDamiano, BPMaryanoff, BE Novel bis(indolyl)maleimide pyridinophanes that are potent, selective inhibitors of glycogen synthase kinase-3. Bioorg Med Chem Lett17:2863-8 (2007) 
 
BDNF/NT-3 growth factors receptor
Name:BDNF/NT-3 growth factors receptor
Type:Enzyme
Mol. Mass.:91996.87
Organism:Homo sapiens (Human)
Description:Q16620
Residue:822
BDBM50371215
NameBDBM50371215
Synonyms:CHEMBL1162963
TypeSmall organic molecule
Emp. Form.C32H29N5O2
Mol. Mass.515.605
SMILESCN(C)c1nc2CCn3cc(C4=C(C(=O)NC4=O)c4cn(CCCc1cc2)c1ccccc41)c1ccccc31