Reaction Details
TargetDipeptidyl peptidase 4
LigandBDBM50232506
Substrate/Competitorn/a
Meas. Tech.ChEMBL_461024 (CHEMBL944056)
IC50 0.5±n/a nM
Citation Kim, DKowalchick, JEBrockunier, LLParmee, EREiermann, GJFisher, MHHe, HLeiting, BLyons, KScapin, GPatel, SBPetrov, APryor, KDRoy, RSWu, JKZhang, XWyvratt, MJZhang, BBZhu, LThornberry, NAWeber, AE Discovery of potent and selective dipeptidyl peptidase IV inhibitors derived from beta-aminoamides bearing subsituted triazolopiperazines. J Med Chem51:589-602 (2008) 
 
Dipeptidyl peptidase 4
Name:Dipeptidyl peptidase 4
Type:Enzyme
Mol. Mass.:88271.01
Organism:Homo sapiens (Human)
Description:P27487
Residue:766
BDBM50232506
NameBDBM50232506
Synonyms:2-[7-[(3R)-3-amino-4-(2,4,5-trifluorophenyl)butanoyl]-3-(trifluoromethyl)-5,6,7,8-tetrahydro[[1,2,4]triazolo[4,3-a]pyrazin-8-yl](4-fluorophenyl)methanol hydrochloride | CHEMBL536536
TypeSmall organic molecule
Emp. Form.C23H20F7N5O2
Mol. Mass.531.426
SMILESN[C@@H](CC(=O)N1CCn2c(nnc2C(F)(F)F)C1C(O)c1ccc(F)cc1)Cc1cc(F)c(F)cc1F