Reaction Details
TargetSomatostatin receptor type 4
LigandBDBM50159392
Substrate/Competitorn/a
Meas. Tech.ChEMBL_461106 (CHEMBL945052)
IC50 1.6±n/a nM
Citation D'Addona, DCarotenuto, ANovellino, EPiccand, VReubi, JCDi Cianni, AGori, FPapini, AMGinanneschi, M Novel sst5-selective somatostatin dicarba-analogues: synthesis and conformation-affinity relationships. J Med Chem51:512-20 (2008) 
 
Somatostatin receptor type 4
Name:Somatostatin receptor type 4
Type:Enzyme
Mol. Mass.:42015.38
Organism:Homo sapiens (Human)
Description:P31391
Residue:388
BDBM50159392
NameBDBM50159392
Synonyms:(4R,7R,10S,13S,16S,19S,22S,25S,28S,31S,34S,37R)-37-{2-[(2S)-2-[(2S)-6-amino-2-[(2S)-2-[(2S)-2-[(2S)-2-{[(2S)-1-[(2S)-2-[(2S)-2-[(2S)-2-{[(2S)-1-[(2R)-2-[(2S)-2-[(2S)-2-[(2S)-2-[(2S)-2-amino-3-hydroxypropanamido]propanamido]-3-carbamoylpropanamido]-3-hydroxypropanamido]-3-carbamoylpropanoyl]pyrrolidin-2-yl]formamido}propanamido]-4-(methylsulfanyl)butanamido]propanoyl]pyrrolidin-2-yl]formamido}-5-carbamimidamidopentanamido]-4-carboxybutanamido]-5-carbamimidamidopentanamido]hexanamido]propanamido]a CHEMBL442494 | SRIF-28
TypeSmall organic molecule
Emp. Form.C137H207N41O39S3
Mol. Mass.3148.556
SMILESCSCC[C@H](NC(=O)[C@H](C)NC(=O)[C@@H]1CCCN1C(=O)[C@H](CC(N)=O)NC(=O)[C@H](CO)NC(=O)[C@H](CC(N)=O)NC(=O)[C@H](C)NC(=O)[C@@H](N)CO)C(=O)N[C@@H](C)C(=O)N1CCC[C@H]1C(=O)N[C@@H](CCCNC(N)=N)C(=O)N[C@@H](CCC(O)=O)C(=O)N[C@@H](CCCNC(N)=N)C(=O)N[C@@H](CCCCN)C(=O)N[C@@H](C)C(=O)NCC(=O)N[C@@H]1CSSC[C@H](NC(=O)[C@H](CO)NC(=O)[C@H](NC(=O)[C@H](Cc2ccccc2)NC(=O)[C@H](NC(=O)[C@H](CCCCN)NC(=O)[C@@H](Cc2c[nH]c3ccccc23)NC(=O)[C@H](Cc2ccccc2)NC(=O)[C@@H](Cc2ccccc2)NC(=O)[C@H](CC(N)=O)NC(=O)[C@@H](CCCCN)NC1=O)[C@@H](C)O)[C@@H](C)O)C(O)=O