Reaction Details
TargetCathepsin K
LigandBDBM50233037
Substrate/Competitorn/a
Meas. Tech.ChEMBL_462245 (CHEMBL945079)
IC50 16±n/a nM
Citation Gauthier, JYChauret, NCromlish, WDesmarais, SDuong, le TFalgueyret, JPKimmel, DBLamontagne, SLéger, SLeRiche, TLi, CSMassé, FMcKay, DJNicoll-Griffith, DAOballa, RMPalmer, JTPercival, MDRiendeau, DRobichaud, JRodan, GARodan, SBSeto, CThérien, MTruong, VLVenuti, MCWesolowski, GYoung, RNZamboni, RBlack, WC The discovery of odanacatib (MK-0822), a selective inhibitor of cathepsin K. Bioorg Med Chem Lett18:923-8 (2008) 
 
Cathepsin K
Name:Cathepsin K
Type:Enzyme
Mol. Mass.:36975.68
Organism:Homo sapiens (Human)
Description:P43235
Residue:329
BDBM50233037
NameBDBM50233037
Synonyms:(S)-4-methyl-2-[(S)-2,2,2-trifluoro-1-(4'-methanesulfonyl-biphenyl-4-yl)-ethylamino]-pentanoic acid (cyano-dicyclobutyl-methyl)-amide | CHEMBL252581
TypeSmall organic molecule
Emp. Form.C31H38F3N3O3S
Mol. Mass.589.712
SMILESCC(C)C[C@H](N[C@@H](c1ccc(cc1)-c1ccc(cc1)S(C)(=O)=O)C(F)(F)F)C(=O)NC(C#N)(C1CCC1)C1CCC1