Reaction Details
TargetB1 bradykinin receptor
LigandBDBM50229295
Substrate/Competitorn/a
Meas. Tech.ChEMBL_463213 (CHEMBL947210)
Ki 13±n/a nM
Citation Wood, MRSchirripa, KMKim, JJKuduk, SDChang, RKDi Marco, CNDiPardo, RMWan, BLMurphy, KLRansom, RWChang, RSHolahan, MACook, JJLemaire, WMosser, SDBednar, RATang, CPrueksaritanont, TWallace, AAMei, QYu, JBohn, DLClayton, FCAdarayn, EDSitko, GRLeonard, YMFreidinger, RMPettibone, DJBock, MG Alpha-hydroxy amides as a novel class of bradykinin B1 selective antagonists. Bioorg Med Chem Lett18:716-20 (2008) 
 
B1 bradykinin receptor
Name:B1 bradykinin receptor
Type:PROTEIN
Mol. Mass.:39519.62
Organism:Oryctolagus cuniculus
Description:ChEMBL_796432
Residue:352
BDBM50229295
NameBDBM50229295
Synonyms:(R)-N-((R)-1-(5-(5-chloro-3-fluoro-2-(5-methyl-1,2,4-oxadiazol-3-yl)phenyl)-3-fluoropyridin-2-yl)ethyl)-3,3,3-trifluoro-2-hydroxy-2-methylpropanamide | CHEMBL402831
TypeSmall organic molecule
Emp. Form.C20H16ClF5N4O3
Mol. Mass.490.811
SMILESC[C@@H](NC(=O)[C@@](C)(O)C(F)(F)F)c1ncc(cc1F)-c1cc(Cl)cc(F)c1-c1noc(C)n1