Reaction Details
TargetB1 bradykinin receptor
LigandBDBM50371322
Substrate/Competitorn/a
Meas. Tech.ChEMBL_463209 (CHEMBL947206)
Ki 0.79±n/a nM
Citation Wood, MRSchirripa, KMKim, JJKuduk, SDChang, RKDi Marco, CNDiPardo, RMWan, BLMurphy, KLRansom, RWChang, RSHolahan, MACook, JJLemaire, WMosser, SDBednar, RATang, CPrueksaritanont, TWallace, AAMei, QYu, JBohn, DLClayton, FCAdarayn, EDSitko, GRLeonard, YMFreidinger, RMPettibone, DJBock, MG Alpha-hydroxy amides as a novel class of bradykinin B1 selective antagonists. Bioorg Med Chem Lett18:716-20 (2008) 
 
B1 bradykinin receptor
Name:B1 bradykinin receptor
Type:Enzyme
Mol. Mass.:40508.87
Organism:Homo sapiens (Human)
Description:P46663
Residue:353
BDBM50371322
NameBDBM50371322
Synonyms:CHEMBL257729
TypeSmall organic molecule
Emp. Form.C20H16Cl2F4N4O3
Mol. Mass.507.266
SMILESC[C@@H](NC(=O)[C@@](C)(O)C(F)(F)F)c1ncc(cc1F)-c1cc(Cl)cc(Cl)c1-c1nc(C)no1