Reaction Details
TargetAcetylcholinesterase
LigandBDBM50371470
Substrate/Competitorn/a
Meas. Tech.ChEMBL_463671 (CHEMBL929818)
IC50 4230±n/a nM
Citation Piazzi, LCavalli, AColizzi, FBelluti, FBartolini, MMancini, FRecanatini, MAndrisano, VRampa, A Multi-target-directed coumarin derivatives: hAChE and BACE1 inhibitors as potential anti-Alzheimer compounds. Bioorg Med Chem Lett18:423-6 (2008) 
 
Acetylcholinesterase
Name:Acetylcholinesterase
Type:Enzyme
Mol. Mass.:67792.70
Organism:Homo sapiens (Human)
Description:P22303
Residue:614
BDBM50371470
NameBDBM50371470
Synonyms:CHEMBL270248
TypeSmall organic molecule
Emp. Form.C36H32Cl2N2O4
Mol. Mass.627.556
SMILESCCN(Cc1ccccc1)Cc1ccc(cc1)-c1cc2ccc(OCCNC(=O)\C=C\c3ccc(Cl)c(Cl)c3)cc2oc1=O