Reaction Details
TargetAcetylcholinesterase
LigandBDBM50218528
Substrate/Competitorn/a
Meas. Tech.ChEMBL_463671 (CHEMBL929818)
IC50 18±n/a nM
Citation Piazzi, LCavalli, AColizzi, FBelluti, FBartolini, MMancini, FRecanatini, MAndrisano, VRampa, A Multi-target-directed coumarin derivatives: hAChE and BACE1 inhibitors as potential anti-Alzheimer compounds. Bioorg Med Chem Lett18:423-6 (2008) 
 
Acetylcholinesterase
Name:Acetylcholinesterase
Type:Enzyme
Mol. Mass.:67792.70
Organism:Homo sapiens (Human)
Description:P22303
Residue:614
BDBM50218528
NameBDBM50218528
Synonyms:3-(4-((benzyl(ethyl)amino)methyl)phenyl)-6,7-dimethoxy-2H-chromen-2-one AP-2243 | CHEMBL244416
TypeSmall organic molecule
Emp. Form.C27H27NO4
Mol. Mass.429.5076
SMILESCCN(Cc1ccccc1)Cc1ccc(cc1)-c1cc2cc(OC)c(OC)cc2oc1=O