Reaction Details
TargetNPC1-like intracellular cholesterol transporter 1
LigandBDBM50371518
Substrate/Competitorn/a
Meas. Tech.ChEMBL_463744 (CHEMBL932102)
Ki>50000±n/a nM
Citation Pfefferkorn, JALarsen, SDVan Huis, CSorenson, RBarton, TWinters, TAuerbach, BWu, CWolfram, TJCai, HWelch, KEsmaiel, NDavis, JBousley, ROlsen, KMueller, SBMertz, T Substituted oxazolidinones as novel NPC1L1 ligands for the inhibition of cholesterol absorption. Bioorg Med Chem Lett18:546-53 (2008) 
 
NPC1-like intracellular cholesterol transporter 1
Name:NPC1-like intracellular cholesterol transporter 1
Type:PROTEIN
Mol. Mass.:146415.18
Organism:Rattus norvegicus
Description:ChEMBL_463744
Residue:1331
BDBM50371518
NameBDBM50371518
Synonyms:CHEMBL402308
TypeSmall organic molecule
Emp. Form.C23H18F2N2O4
Mol. Mass.424.3968
SMILESOc1ccc(cc1)[C@@H]1[C@@H](CNC(=O)c2ccc(F)cc2)OC(=O)N1c1ccc(F)cc1