Reaction Details
TargetNPC1-like intracellular cholesterol transporter 1
LigandBDBM50371519
Substrate/Competitorn/a
Meas. Tech.ChEMBL_463744 (CHEMBL932102)
Ki 1400±n/a nM
Citation Pfefferkorn, JALarsen, SDVan Huis, CSorenson, RBarton, TWinters, TAuerbach, BWu, CWolfram, TJCai, HWelch, KEsmaiel, NDavis, JBousley, ROlsen, KMueller, SBMertz, T Substituted oxazolidinones as novel NPC1L1 ligands for the inhibition of cholesterol absorption. Bioorg Med Chem Lett18:546-53 (2008) 
 
NPC1-like intracellular cholesterol transporter 1
Name:NPC1-like intracellular cholesterol transporter 1
Type:PROTEIN
Mol. Mass.:146415.18
Organism:Rattus norvegicus
Description:ChEMBL_463744
Residue:1331
BDBM50371519
NameBDBM50371519
Synonyms:CHEMBL271655
TypeSmall organic molecule
Emp. Form.C25H22F2N2O5
Mol. Mass.468.4494
SMILESCOc1ccc([C@@H]2[C@H](OC(=O)N2c2cccc(F)c2)C(=O)N(C)Cc2ccc(F)cc2)c(O)c1