Reaction Details
TargetNPC1-like intracellular cholesterol transporter 1
LigandBDBM50371520
Substrate/Competitorn/a
Meas. Tech.ChEMBL_463744 (CHEMBL932102)
Ki 4800±n/a nM
Citation Pfefferkorn, JALarsen, SDVan Huis, CSorenson, RBarton, TWinters, TAuerbach, BWu, CWolfram, TJCai, HWelch, KEsmaiel, NDavis, JBousley, ROlsen, KMueller, SBMertz, T Substituted oxazolidinones as novel NPC1L1 ligands for the inhibition of cholesterol absorption. Bioorg Med Chem Lett18:546-53 (2008) 
 
NPC1-like intracellular cholesterol transporter 1
Name:NPC1-like intracellular cholesterol transporter 1
Type:PROTEIN
Mol. Mass.:146415.18
Organism:Rattus norvegicus
Description:ChEMBL_463744
Residue:1331
BDBM50371520
NameBDBM50371520
Synonyms:CHEMBL257848
TypeSmall organic molecule
Emp. Form.C25H24FNO5
Mol. Mass.437.4602
SMILESCOc1ccc([C@@H]2[C@H](OC(=O)N2c2ccc(F)cc2)[C@H](O)CCc2ccccc2)c(O)c1