Reaction Details
TargetNPC1-like intracellular cholesterol transporter 1
LigandBDBM50371521
Substrate/Competitorn/a
Meas. Tech.ChEMBL_463744 (CHEMBL932102)
Ki 200±n/a nM
Citation Pfefferkorn, JALarsen, SDVan Huis, CSorenson, RBarton, TWinters, TAuerbach, BWu, CWolfram, TJCai, HWelch, KEsmaiel, NDavis, JBousley, ROlsen, KMueller, SBMertz, T Substituted oxazolidinones as novel NPC1L1 ligands for the inhibition of cholesterol absorption. Bioorg Med Chem Lett18:546-53 (2008) 
 
NPC1-like intracellular cholesterol transporter 1
Name:NPC1-like intracellular cholesterol transporter 1
Type:PROTEIN
Mol. Mass.:146415.18
Organism:Rattus norvegicus
Description:ChEMBL_463744
Residue:1331
BDBM50371521
NameBDBM50371521
Synonyms:EZETIMIBE
TypeSmall organic molecule
Emp. Form.C24H21F2NO3
Mol. Mass.409.4252
SMILESO[C@@H](CC[C@@H]1[C@H](N(C1=O)c1ccc(F)cc1)c1ccc(O)cc1)c1ccc(F)cc1