Reaction Details
TargetNPC1-like intracellular cholesterol transporter 1
LigandBDBM50371531
Substrate/Competitorn/a
Meas. Tech.ChEMBL_463744 (CHEMBL932102)
Ki>50000±n/a nM
Citation Pfefferkorn, JALarsen, SDVan Huis, CSorenson, RBarton, TWinters, TAuerbach, BWu, CWolfram, TJCai, HWelch, KEsmaiel, NDavis, JBousley, ROlsen, KMueller, SBMertz, T Substituted oxazolidinones as novel NPC1L1 ligands for the inhibition of cholesterol absorption. Bioorg Med Chem Lett18:546-53 (2008) 
 
NPC1-like intracellular cholesterol transporter 1
Name:NPC1-like intracellular cholesterol transporter 1
Type:PROTEIN
Mol. Mass.:146415.18
Organism:Rattus norvegicus
Description:ChEMBL_463744
Residue:1331
BDBM50371531
NameBDBM50371531
Synonyms:CHEMBL255984
TypeSmall organic molecule
Emp. Form.C30H30FNO10
Mol. Mass.583.5583
SMILESO[C@H](CCc1ccccc1)[C@H]1OC(=O)N([C@@H]1c1ccc(O[C@@H]2O[C@@H]([C@@H](O)[C@H](O)[C@H]2O)C(O)=O)cc1)c1ccc(F)cc1