Reaction Details
TargetGrowth hormone secretagogue receptor type 1
LigandBDBM50371683
Substrate/Competitorn/a
Meas. Tech.ChEMBL_463847 (CHEMBL934041)
Ki 240±n/a nM
Citation Hernández, ASSwartz, SGSlusarchyk, DYan, MSeethala, RKSleph, PGrover, GDickinson, KGiupponi, LHarper, TWHumphreys, WGLonghi, DAFlynn, NMurphy, BJGordon, DABiller, SARobl, JATino, JA Optimization of 1H-tetrazole-1-alkanenitriles as potent orally bioavailable growth hormone secretagogues. Bioorg Med Chem Lett18:2067-72 (2008) 
 
Growth hormone secretagogue receptor type 1
Name:Growth hormone secretagogue receptor type 1
Type:Receptor
Mol. Mass.:41334.57
Organism:Homo sapiens (Human)
Description:Receptor binding studies use plasma membranes from LLC PK-1 cells transiently transfected with hGHSR1a.
Residue:366
BDBM50371683
NameBDBM50371683
Synonyms:CHEMBL410060
TypeSmall organic molecule
Emp. Form.C24H29N7O4
Mol. Mass.479.5316
SMILESCC(C)(N)C(=O)N[C@H](COCc1ccccc1)c1nnnn1[C@H](COc1ccccc1O)CC#N