Reaction Details
TargetCytochrome P450 2C9
LigandBDBM50371684
Substrate/Competitorn/a
Meas. Tech.ChEMBL_463853 (CHEMBL934047)
IC50>66000±n/a nM
Citation Hernández, ASSwartz, SGSlusarchyk, DYan, MSeethala, RKSleph, PGrover, GDickinson, KGiupponi, LHarper, TWHumphreys, WGLonghi, DAFlynn, NMurphy, BJGordon, DABiller, SARobl, JATino, JA Optimization of 1H-tetrazole-1-alkanenitriles as potent orally bioavailable growth hormone secretagogues. Bioorg Med Chem Lett18:2067-72 (2008) 
 
Cytochrome P450 2C9
Name:Cytochrome P450 2C9
Type:Enzyme
Mol. Mass.:55636.33
Organism:Homo sapiens (Human)
Description:P11712
Residue:490
BDBM50371684
NameBDBM50371684
Synonyms:CHEMBL270666
TypeSmall organic molecule
Emp. Form.C24H29N7O4
Mol. Mass.479.5316
SMILESCC(C)(N)C(=O)N[C@H](COCc1ccccc1)c1nnnn1[C@@H](COc1ccccc1O)CC#N