Reaction Details
TargetAdenosine receptor A2a
LigandBDBM50233816
Substrate/Competitorn/a
Meas. Tech.ChEMBL_464500 (CHEMBL931999)
IC50 6±n/a nM
Citation Mantell, SJStephenson, PTMonaghan, SMMaw, GNTrevethick, MAYeadon, MKeir, RFWalker, DKJones, RMSelby, MDBatchelor, DVRozze, SChavaroche, HHobson, TJDodd, PGLemaitre, AWright, KNStuart, EF Inhaled adenosine A(2A) receptor agonists for the treatment of chronic obstructive pulmonary disease. Bioorg Med Chem Lett18:1284-7 (2008) 
 
Adenosine receptor A2a
Name:Adenosine receptor A2a
Type:G Protein-Coupled Receptor (GPCR)
Mol. Mass.:44716.46
Organism:Homo sapiens (Human)
Description:P29274
Residue:412
BDBM50233816
NameBDBM50233816
Synonyms:(2S,3S,4R,5R)-5-(2-((3-(2-(cyclopentyl(isopropyl)amino)ethyl)ureido)methyl)-6-(2,2-diphenylethylamino)-9H-purin-9-yl)-N-ethyl-3,4-dihydroxytetrahydrofuran-2-carboxamide CHEMBL272761
TypeSmall organic molecule
Emp. Form.C38H51N9O5
Mol. Mass.713.8688
SMILESCCNC(=O)[C@H]1O[C@H]([C@H](O)[C@@H]1O)n1cnc2c(NCC(c3ccccc3)c3ccccc3)nc(CNC(=O)NCCN(C(C)C)C3CCCC3)nc12