Reaction Details
TargetChymase
LigandBDBM50069989
Substrate/Competitorn/a
Meas. Tech.ChEMBL_464567 (CHEMBL933253)
IC50 1190±n/a nM
Citation Dorsey, BDIqbal, MChatterjee, SMenta, EBernardini, RBernareggi, ACassarà, PGD'Arasmo, GFerretti, EDe Munari, SOliva, APezzoni, GAllievi, CStrepponi, IRuggeri, BAtor, MAWilliams, MMallamo, JP Discovery of a potent, selective, and orally active proteasome inhibitor for the treatment of cancer. J Med Chem51:1068-72 (2008) 
 
Chymase
Name:Chymase
Type:Enzyme
Mol. Mass.:27340.12
Organism:Homo sapiens (Human)
Description:n/a
Residue:247
BDBM50069989
NameBDBM50069989
Synonyms:(R)-3-methyl-1-((S)-3-phenyl-2-(pyrazine-2-carboxamido)propanamido)butylboronic acid BORTEZOMIB Dipeptidyl boronic acid derivative N-[(1R)-1-(DIHYDROXYBORYL)-3-METHYLBUTYL]-N-(PYRAZIN-2-YLCARBONYL)-L-PHENYLALANINAMIDE Peptidyl boronic acid derivative Velcade | cid_387447
TypeSmall organic molecule
Emp. Form.C19H25BN4O4
Mol. Mass.384.237
SMILESCC(C)C[C@H](NC(=O)[C@H](Cc1ccccc1)NC(=O)c1cnccn1)B(O)O