Reaction Details
TargetProstaglandin E2 receptor EP4 subtype
LigandBDBM50372051
Substrate/Competitorn/a
Meas. Tech.ChEMBL_464678 (CHEMBL934070)
Ki 0.21±n/a nM
Citation Burch, JDBelley, MFortin, RDeschênes, DGirard, MColucci, JFarand, JTherien, AGMathieu, MCDenis, DVigneault, ELévesque, JFGagné, SWrona, MXu, DClark, PRowland, SHan, Y Structure-activity relationships and pharmacokinetic parameters of quinoline acylsulfonamides as potent and selective antagonists of the EP(4) receptor. Bioorg Med Chem Lett18:2048-54 (2008) 
 
Prostaglandin E2 receptor EP4 subtype
Name:Prostaglandin E2 receptor EP4 subtype
Type:Enzyme
Mol. Mass.:53134.53
Organism:Homo sapiens (Human)
Description:P35408
Residue:488
BDBM50372051
NameBDBM50372051
Synonyms:CHEMBL269987
TypeSmall organic molecule
Emp. Form.C32H30F3N3O7S
Mol. Mass.657.657
SMILESCCOc1c2C(=O)N(Cc2c(OCC)c2ncccc12)c1ccc(CS(=O)(=O)NC(=O)Cc2ccccc2OC(F)(F)F)cc1C