Reaction Details
TargetProstaglandin E2 receptor EP4 subtype
LigandBDBM50372058
Substrate/Competitorn/a
Meas. Tech.ChEMBL_464678 (CHEMBL934070)
Ki 0.79±n/a nM
Citation Burch, JDBelley, MFortin, RDeschênes, DGirard, MColucci, JFarand, JTherien, AGMathieu, MCDenis, DVigneault, ELévesque, JFGagné, SWrona, MXu, DClark, PRowland, SHan, Y Structure-activity relationships and pharmacokinetic parameters of quinoline acylsulfonamides as potent and selective antagonists of the EP(4) receptor. Bioorg Med Chem Lett18:2048-54 (2008) 
 
Prostaglandin E2 receptor EP4 subtype
Name:Prostaglandin E2 receptor EP4 subtype
Type:Enzyme
Mol. Mass.:53134.53
Organism:Homo sapiens (Human)
Description:P35408
Residue:488
BDBM50372058
NameBDBM50372058
Synonyms:CHEMBL404199
TypeSmall organic molecule
Emp. Form.C35H31F6N3O8S
Mol. Mass.767.691
SMILESCOc1cccc(OC)c1C1(CC1)C(=O)NS(=O)(=O)Cc1ccc(N2Cc3c(C2=O)c(OCC(F)(F)F)c2cccnc2c3OCC(F)(F)F)c(C)c1