Reaction Details
TargetProstaglandin E2 receptor EP4 subtype
LigandBDBM50372068
Substrate/Competitorn/a
Meas. Tech.ChEMBL_464678 (CHEMBL934070)
Ki 0.74±n/a nM
Citation Burch, JDBelley, MFortin, RDeschênes, DGirard, MColucci, JFarand, JTherien, AGMathieu, MCDenis, DVigneault, ELévesque, JFGagné, SWrona, MXu, DClark, PRowland, SHan, Y Structure-activity relationships and pharmacokinetic parameters of quinoline acylsulfonamides as potent and selective antagonists of the EP(4) receptor. Bioorg Med Chem Lett18:2048-54 (2008) 
 
Prostaglandin E2 receptor EP4 subtype
Name:Prostaglandin E2 receptor EP4 subtype
Type:Enzyme
Mol. Mass.:53134.53
Organism:Homo sapiens (Human)
Description:P35408
Residue:488
BDBM50372068
NameBDBM50372068
Synonyms:CHEMBL402162
TypeSmall organic molecule
Emp. Form.C32H33N3O7S
Mol. Mass.603.685
SMILESCCOc1c2C(=O)N(Cc2c(OCC)c2ncccc12)c1ccc(CS(=O)(=O)NC(=O)Cc2ccccc2OC)cc1C